{"text_format":"1","workbook":"xlsx","n_sheets":8,"sheets":["Submission Template","Supplier Instructions for RFQ","Product Groups","Platforms","Product Group Determiner","Claim types validation","Claim Event validation","Claim Event Reference"],"not_rendered":{"charts":0,"images":14,"macros":1,"external_links":0,"defined_names":6,"comments":0,"pivot_tables":2},"unopened":[],"bounds":{"document_bytes":16777216,"sheet_cells":100000,"rows_first":2000,"rows_last":500,"rows_between":2000,"halvings":0,"cell_chars":16384,"cell_head_chars":4096},"cells_cut":0,"cells_raw":0,"read":"whole","date_system":"1900"}

{"sheet":"Submission Template","index":0,"n_rows":26,"n_cols":12,"rows_kept":26,"cut":false,"hidden":false,"merged":[[1,0,1,1],[2,3,2,6],[3,3,3,6],[6,3,7,6],[9,3,10,6],[20,3,20,6],[18,3,18,6],[21,3,21,6],[23,3,24,6],[12,3,14,6],[16,3,16,6],[17,3,17,6]]}
[null,null,null,"INSTRUCTIONS:"]
["ORACLE SUPPLIER CLAIMS SUBMISSION TEMPLATE",null,"1)","Please complete this claims submission template in its entirety."]
[null,null,"2)","Email this completed template in pdf format to:",null,null,null,{"$f":"NOW()-(5*365)","v":"2017-05-26T13:11:27.890"}]
[null,null,null,"Email a zipfile with this completed Template (in pdf format) and Supporting Documentation file(s) to justify the claim amount to:  "]
[" Claim Type   Select from drop-down menu",null,null,"submitclaims_ww@oracle.com",null,null,null,null,null,1,{"$f":"IF(ISERROR(VLOOKUP(J5,'Claim types validation'!C:D,2,FALSE)),\"Not Set\",VLOOKUP(J5,'Claim types validation'!C:D,2,FALSE))","v":"Not Set"},{"$f":"LEFT(K5,7)","v":"Not Set"}]
[]
[" Event Name  Select from drop-down menu","","3)","Upon receipt, you will receive an automatic reply with an assigned claims number."]
[]
["Event Date (DD/MM/YYYY)"]
[null,null,"4)","After Oracle receives the claim template, the Supplier Contact listed will receive an RFQ from Oracle to collect the details of the claim.  Please allow 2-3 business days for the RFQ to be sent."]
["Supplier Name (Company Name)"]
[]
["Supplier Site Name (City)",null,"5)","Respond to the RFQ in Oracle's iSupplier Portal to provide the amount of the claim.   During this process, please also attach to your RFQ response any supporting documentation to justify the amount of the claim.   "]
[]
["Supplier Contact Name (Person Oracle should contact )"]
["Supplier Contact email"]
[null,null,null,"Oracle's iSupplier portal can be found here:  "]
["Oracle Claim Owner Name (if known)",null,null,"https://suppliers.oracle.com"]
[null,null,null,"Click on the link that corresponds with Accounts Payable and Purchasing applications"]
["Oracle Sourcing Manager Name (if known)"]
[null,null,null,"Video instructions on how to respond to an RFQ can be found here:"]
["Oracle Platform Name",null,null,"https://videohub.oracle.com/media/Responding+to+RFQ/1_fufzo2hp/102877741"]
["Please describe:"]
["Product Group   Reference field - will auto-populate",{"$f":"'Product Group Determiner'!$D$3","v":""},null,"A text version of instructions on how to respond to an RFQ can be found in the \"Supplier instructions for RFQ\" tab of this spreadsheet."]
[]
["Claim Amount in USD $"]

{"sheet":"Supplier Instructions for RFQ","index":1,"n_rows":158,"n_cols":1,"rows_kept":158,"cut":false,"hidden":false,"merged":[]}
["Instructions for responding to an RFQ"]
[]
["After logging into the iSupplier Portal click on the Supplier Portal icon"]
[]
[]
[]
[]
[]
[]
[]
[]
[]
[]
[]
[]
[]
[]
["Select \"View Active Negotiations\"  from the menu options on the left side of the screen"]
[]
[]
[]
[]
[]
[]
[]
[]
[]
[]
[]
[]
[]
[]
[]
[]
[]
[]
["Select the RFQ to which you are responding by clicking on the blank space to the left of the Negotiation number."]
[]
[]
[]
{"$rows_left_out":119}
{"sheet":"Product Groups","index":2,"n_rows":8,"n_cols":1,"rows_kept":8,"cut":false,"hidden":true,"merged":[]}
["Product Group"]
["Global Manufacturing and Logistics"]
["Global Planning and Fulfillment"]
["Global Supplier Management"]
["Product Lifecycle and Technology"]
["Direct-to-Customer (SPARC/NETRA/CBGU)"]
["Direct-to-Customer (MICROS)"]
["Direct-to-Customer (Tape Library)"]

{"sheet":"Platforms","index":3,"n_rows":77,"n_cols":2,"rows_kept":77,"cut":false,"hidden":true,"merged":[]}
["Platforms","Product Group"]
[]
["42RU SERVER-LESS RACK","CLOUD"]
["A1","CLOUD"]
["A2-2C","CLOUD"]
["A3-2C","CLOUD"]
["A4-2C","CLOUD"]
["ACME PACKET 1100","Direct-to-Customer (SPARC/NETRA/CBGU)"]
["ACME PACKET 3900","Direct-to-Customer (SPARC/NETRA/CBGU)"]
["ACME PACKET 3950","Direct-to-Customer (SPARC/NETRA/CBGU)"]
["ACME PACKET 4600","Direct-to-Customer (SPARC/NETRA/CBGU)"]
["ACME PACKET 4900","Direct-to-Customer (SPARC/NETRA/CBGU)"]
["ACME PACKET 6100","Direct-to-Customer (SPARC/NETRA/CBGU)"]
["ACME PACKET 6300","Direct-to-Customer (SPARC/NETRA/CBGU)"]
["ACME PACKET 6350","Direct-to-Customer (SPARC/NETRA/CBGU)"]
["C2","CLOUD"]
["DE3-24C","CLOUD"]
["DE3-24P","CLOUD"]
["E1-2c","CLOUD"]
["E2-2c","CLOUD"]
["E4","CLOUD"]
["E5-2C","CLOUD"]
["E5-2L","CLOUD"]
["E6","CLOUD"]
["EAGLE","Direct-to-Customer (SPARC/NETRA/CBGU)"]
["FUJITSU M10-1","Direct-to-Customer (SPARC/NETRA/CBGU)"]
["FUJITSU M10-4S","Direct-to-Customer (SPARC/NETRA/CBGU)"]
["FUJITSU SPARC M12","Direct-to-Customer (SPARC/NETRA/CBGU)"]
["GPU Rack","CLOUD"]
["MICROS","Direct-to-Customer (MICROS)"]
["NETRA SPARC S7-2","CLOUD"]
["Network Rack Stand Alone","CLOUD"]
["ORACLE KEY MANAGER","CLOUD"]
["SD-WAN","CLOUD"]
["SPARC M7","Direct-to-Customer (MICROS)"]
["SPARC M8-8","Direct-to-Customer (MICROS)"]
["SPARC S7-2","Direct-to-Customer (MICROS)"]
["SPARC S7-2L","Direct-to-Customer (MICROS)"]
["SPARC T7-1","Direct-to-Customer (MICROS)"]
["SPARC T8-1","Direct-to-Customer (MICROS)"]
{"$rows_left_out":38}
{"sheet":"Product Group Determiner","index":4,"n_rows":3,"n_cols":4,"rows_kept":3,"cut":false,"hidden":true,"merged":[]}
[{"$f":"'Submission Template'!K5","v":"Not Set"},{"$f":"'Submission Template'!B7","v":""},{"$f":"A1&B1","v":"Not Set"},{"$f":"VLOOKUP(C1,'Claim Event Reference'!D:E,2,FALSE)","v":{"$error":"#N/A"}}]
[null,null,{"$f":"'Submission Template'!B22","v":0},{"$f":"VLOOKUP(C2,Platforms!A:B,2,FALSE)","v":{"$error":"#N/A"}}]
[null,null,null,{"$f":"IF(ISERROR(IF(D2=\"CLOUD\",D1,D2)),\"\",IF(D2=\"CLOUD\",D1,D2))","v":""}]

{"sheet":"Claim types validation","index":5,"n_rows":37,"n_cols":4,"rows_kept":37,"cut":false,"hidden":true,"merged":[]}
[]
[]
["Row Labels"]
["Aged Buffer",{"$f":"IF(A4=0,\"\",IF(A4=\"(blank)\",\"\",A4))","v":"Aged Buffer"},2,{"$f":"B4","v":"Aged Buffer"}]
["Excess and Obsolete",{"$f":"IF(A5=0,\"\",IF(A5=\"(blank)\",\"\",A5))","v":"Excess and Obsolete"},{"$f":"C4+1","v":3},{"$f":"B5","v":"Excess and Obsolete"}]
["Excess and Obsolete (Quality)","Excess and Obsolete (Quality)",{"$f":"C5+1","v":4},"Excess and Obsolete (Quality)"]
["Inventory Revaluation","Inventory Revaluation",5,"Inventory Revaluation"]
["Premium Charges","Premium Charges",6,"Premium Charges"]
["Purchase Price Variance","Purchase Price Variance",7,"Purchase Price Variance"]
["Reverse Claim","Reverse Claim",8,"Reverse Claim"]
["Reverse Claim - Excess & Obsolete","Reverse Claim - Excess & Obsolete",9,"Reverse Claim - Excess & Obsolete"]
["Reverse Claim - Inventory Revaluation","Reverse Claim - Inventory Revaluation",10,"Reverse Claim - Inventory Revaluation"]
["Reverse Claim - Rework","Reverse Claim - Rework",11,"Reverse Claim - Rework"]
["Reverse Claims - PPV","Reverse Claims - PPV",12,"Reverse Claims - PPV"]
["Reverse Claims - Premium Charges","Reverse Claims - Premium Charges",13,"Reverse Claims - Premium Charges"]
["Rework","Rework",14,"Rework"]
["(blank)","",15,""]
[null,"",16,""]
[null,"",17,""]
[null,"",18,""]
[null,"",19,""]
[null,"",20,""]
[null,"",21,""]
[null,"",22,""]
[null,"",23,""]
[null,"",24,""]
[null,"",25,""]
[null,"",26,""]
[null,"",27,""]
[null,"",28,""]
[null,"",29,""]
[null,"",30,""]
[null,"",31,""]
[null,"",32,""]
[null,"",33,""]
[null,"",34,""]
[null,"",35,""]

{"sheet":"Claim Event validation","index":6,"n_rows":37,"n_cols":2,"rows_kept":37,"cut":false,"hidden":true,"merged":[]}
[]
[]
["Row Labels"]
[null,{"$f":"IF(A4=0,\"\",IF(A4=\"(blank)\",\"\",A4))","v":""}]
["(blank)",{"$f":"IF(A5=0,\"\",IF(A5=\"(blank)\",\"\",A5))","v":""}]
[null,""]
[null,""]
[null,""]
[null,""]
[null,""]
[null,""]
[null,""]
[null,""]
[null,""]
[null,""]
[null,""]
[null,""]
[null,""]
[null,""]
[null,""]
[null,""]
[null,""]
[null,""]
[null,""]
[null,""]
[null,""]
[null,""]
[null,""]
[null,""]
[null,""]
[null,""]
[null,""]
[null,""]
[null,""]
[null,""]
[null,""]
[null,""]

{"sheet":"Claim Event Reference","index":7,"n_rows":853,"n_cols":25,"rows_kept":853,"cut":false,"hidden":true,"merged":[]}
["-Select Claim Type-",null,"-Select Claim Event",null,"Product Group",null,null,null,null,null,"Product Group",null,null,null,null,null,null,null,null,null,null,null,null,null,"-Select Claim Event"]
["Excess and Obsolete",null,"Excess and Obsolete",{"$f":"A2&C2","v":"Excess and ObsoleteExcess and Obsolete"},"Global Planning and Fulfillment",null,null,null,null,null,"Global Manufacturing and Logistics",null,null,null,null,null,null,null,null,null,null,null,null,null,{"$f":"IF(ISERROR(VLOOKUP(A2,'Submission Template'!$K$5,1,FALSE)),\"\",C2)","v":""}]
["Excess and Obsolete",null,"AVL Changes",{"$f":"A3&C3","v":"Excess and ObsoleteAVL Changes"},"Global Supplier Management",null,null,null,null,null,"Global Planning and Fulfillment",null,null,null,null,null,null,null,null,null,null,null,null,null,{"$f":"IF(ISERROR(VLOOKUP(A3,'Submission Template'!$K$5,1,FALSE)),\"\",C3)","v":""}]
["Excess and Obsolete",null,"ECO Changes","Excess and ObsoleteECO Changes","Product Lifecycle and Technology",null,null,null,null,null,"Global Supplier Management",null,null,null,null,null,null,null,null,null,null,null,null,null,{"$f":"IF(ISERROR(VLOOKUP(A4,'Submission Template'!$K$5,1,FALSE)),\"\",C4)","v":""}]
["Excess and Obsolete",null,"Last Time Buy","Excess and ObsoleteLast Time Buy","Global Planning and Fulfillment",null,null,null,null,null,"Product Lifecycle and Technology",null,null,null,null,null,null,null,null,null,null,null,null,null,{"$f":"IF(ISERROR(VLOOKUP(A5,'Submission Template'!$K$5,1,FALSE)),\"\",C5)","v":""}]
["Excess and Obsolete",null,"Part Purges","Excess and ObsoletePart Purges","Global Planning and Fulfillment",null,null,null,null,null,null,null,null,null,null,null,null,null,null,null,null,null,null,null,{"$f":"IF(ISERROR(VLOOKUP(A6,'Submission Template'!$K$5,1,FALSE)),\"\",C6)","v":""}]
["Excess and Obsolete",null,"Product End of Life","Excess and ObsoleteProduct End of Life","Product Lifecycle and Technology",null,null,null,null,null,null,null,null,null,null,null,null,null,null,null,null,null,null,null,{"$f":"IF(ISERROR(VLOOKUP(A7,'Submission Template'!$K$5,1,FALSE)),\"\",C7)","v":""}]
["Excess and Obsolete",null,"Quality Cost (Purge, Scrap, etc.)","Excess and ObsoleteQuality Cost (Purge, Scrap, etc.)","Global Manufacturing and Logistics",null,null,null,null,null,null,null,null,null,null,null,null,null,null,null,null,null,null,null,{"$f":"IF(ISERROR(VLOOKUP(A8,'Submission Template'!$K$5,1,FALSE)),\"\",C8)","v":""}]
["Excess and Obsolete",null,"Stop Production Notice","Excess and ObsoleteStop Production Notice","Global Planning and Fulfillment",null,null,null,null,null,null,null,null,null,null,null,null,null,null,null,null,null,null,null,{"$f":"IF(ISERROR(VLOOKUP(A9,'Submission Template'!$K$5,1,FALSE)),\"\",C9)","v":""}]
["Excess and Obsolete",null,"Supply Plan Reduction","Excess and ObsoleteSupply Plan Reduction","Global Planning and Fulfillment",null,null,null,null,null,null,null,null,null,null,null,null,null,null,null,null,null,null,null,{"$f":"IF(ISERROR(VLOOKUP(A10,'Submission Template'!$K$5,1,FALSE)),\"\",C10)","v":""}]
["Inventory Revaluation",null,"Inventory at EM/Qtr End Revalued for Price Changes","Inventory RevaluationInventory at EM/Qtr End Revalued for Price Changes","Global Supplier Management",null,null,null,null,null,null,null,null,null,null,null,null,null,null,null,null,null,null,null,{"$f":"IF(ISERROR(VLOOKUP(A11,'Submission Template'!$K$5,1,FALSE)),\"\",C11)","v":""}]
["Inventory Revaluation",null,"Supply Plan Reduction","Inventory RevaluationSupply Plan Reduction","Global Planning and Fulfillment",null,null,null,null,null,null,null,null,null,null,null,null,null,null,null,null,null,null,null,{"$f":"IF(ISERROR(VLOOKUP(A12,'Submission Template'!$K$5,1,FALSE)),\"\",C12)","v":""}]
["Purchase Price Variance",null,"Cost Audit","Purchase Price VarianceCost Audit","Global Supplier Management",null,null,null,null,null,null,null,null,null,null,null,null,null,null,null,null,null,null,null,{"$f":"IF(ISERROR(VLOOKUP(A13,'Submission Template'!$K$5,1,FALSE)),\"\",C13)","v":""}]
["Purchase Price Variance",null,"Price Changes","Purchase Price VariancePrice Changes","Global Supplier Management",null,null,null,null,null,null,null,null,null,null,null,null,null,null,null,null,null,null,null,{"$f":"IF(ISERROR(VLOOKUP(A14,'Submission Template'!$K$5,1,FALSE)),\"\",C14)","v":""}]
["Premium Charges",null,"3PL claims for charges over/above standard tarrif rates","Premium Charges3PL claims for charges over/above standard tarrif rates","Global Manufacturing and Logistics",null,null,null,null,null,null,null,null,null,null,null,null,null,null,null,null,null,null,null,{"$f":"IF(ISERROR(VLOOKUP(A15,'Submission Template'!$K$5,1,FALSE)),\"\",C15)","v":""}]
["Premium Charges",null,"Additional freight to deliver Parts Within Lead Time","Premium ChargesAdditional freight to deliver Parts Within Lead Time","Global Manufacturing and Logistics",null,null,null,null,null,null,null,null,null,null,null,null,null,null,null,null,null,null,null,{"$f":"IF(ISERROR(VLOOKUP(A16,'Submission Template'!$K$5,1,FALSE)),\"\",C16)","v":""}]
["Premium Charges",null,"Additional freight for plan upside","Premium ChargesAdditional freight for plan upside","Global Manufacturing and Logistics",null,null,null,null,null,null,null,null,null,null,null,null,null,null,null,null,null,null,null,{"$f":"IF(ISERROR(VLOOKUP(A17,'Submission Template'!$K$5,1,FALSE)),\"\",C17)","v":""}]
["Premium Charges",null,"Inventory carrying cost for last time buys","Premium ChargesInventory carrying cost for last time buys","Global Planning and Fulfillment",null,null,null,null,null,null,null,null,null,null,null,null,null,null,null,null,null,null,null,{"$f":"IF(ISERROR(VLOOKUP(A18,'Submission Template'!$K$5,1,FALSE)),\"\",C18)","v":""}]
["Premium Charges",null,"Inventory carrying cost for Supply Plan Reductions","Premium ChargesInventory carrying cost for Supply Plan Reductions","Global Planning and Fulfillment",null,null,null,null,null,null,null,null,null,null,null,null,null,null,null,null,null,null,null,{"$f":"IF(ISERROR(VLOOKUP(A19,'Submission Template'!$K$5,1,FALSE)),\"\",C19)","v":""}]
["Premium Charges",null,"Inventory Held at Supplier – Contract Term","Premium ChargesInventory Held at Supplier – Contract Term","Global Planning and Fulfillment",null,null,null,null,null,null,null,null,null,null,null,null,null,null,null,null,null,null,null,{"$f":"IF(ISERROR(VLOOKUP(A20,'Submission Template'!$K$5,1,FALSE)),\"\",C20)","v":""}]
["Premium Charges",null,"Material Premium for Plan Upside","Premium ChargesMaterial Premium for Plan Upside","Global Planning and Fulfillment",null,null,null,null,null,null,null,null,null,null,null,null,null,null,null,null,null,null,null,{"$f":"IF(ISERROR(VLOOKUP(A21,'Submission Template'!$K$5,1,FALSE)),\"\",C21)","v":""}]
["Premium Charges",null,"OT required for Plan Upside","Premium ChargesOT required for Plan Upside","Global Planning and Fulfillment",null,null,null,null,null,null,null,null,null,null,null,null,null,null,null,null,null,null,null,{"$f":"IF(ISERROR(VLOOKUP(A22,'Submission Template'!$K$5,1,FALSE)),\"\",C22)","v":""}]
["Premium Charges",null,"OT to Deliver Parts Within LT","Premium ChargesOT to Deliver Parts Within LT","Global Supplier Management",null,null,null,null,null,null,null,null,null,null,null,null,null,null,null,null,null,null,null,{"$f":"IF(ISERROR(VLOOKUP(A23,'Submission Template'!$K$5,1,FALSE)),\"\",C23)","v":""}]
["Aged Buffer",null,"Non-Oracle Unique Material","Aged BufferNon-Oracle Unique Material","Global Planning and Fulfillment",null,null,null,null,null,null,null,null,null,null,null,null,null,null,null,null,null,null,null,{"$f":"IF(ISERROR(VLOOKUP(A24,'Submission Template'!$K$5,1,FALSE)),\"\",C24)","v":""}]
["Aged Buffer",null,"Oracle Unique Material","Aged BufferOracle Unique Material","Global Planning and Fulfillment",null,null,null,null,null,null,null,null,null,null,null,null,null,null,null,null,null,null,null,{"$f":"IF(ISERROR(VLOOKUP(A25,'Submission Template'!$K$5,1,FALSE)),\"\",C25)","v":""}]
["Rework",null,"AVL Changes","ReworkAVL Changes","Global Supplier Management",null,null,null,null,null,null,null,null,null,null,null,null,null,null,null,null,null,null,null,{"$f":"IF(ISERROR(VLOOKUP(A26,'Submission Template'!$K$5,1,FALSE)),\"\",C26)","v":""}]
["Rework",null,"ECO Changes","ReworkECO Changes","Product Lifecycle and Technology",null,null,null,null,null,null,null,null,null,null,null,null,null,null,null,null,null,null,null,{"$f":"IF(ISERROR(VLOOKUP(A27,'Submission Template'!$K$5,1,FALSE)),\"\",C27)","v":""}]
["Rework",null,"Part Purges","ReworkPart Purges","Global Planning and Fulfillment",null,null,null,null,null,null,null,null,null,null,null,null,null,null,null,null,null,null,null,{"$f":"IF(ISERROR(VLOOKUP(A28,'Submission Template'!$K$5,1,FALSE)),\"\",C28)","v":""}]
["Rework",null,"Product End Of Life","ReworkProduct End Of Life","Global Planning and Fulfillment",null,null,null,null,null,null,null,null,null,null,null,null,null,null,null,null,null,null,null,{"$f":"IF(ISERROR(VLOOKUP(A29,'Submission Template'!$K$5,1,FALSE)),\"\",C29)","v":""}]
["Rework",null,"Stop Production Notice","ReworkStop Production Notice","Global Planning and Fulfillment",null,null,null,null,null,null,null,null,null,null,null,null,null,null,null,null,null,null,null,{"$f":"IF(ISERROR(VLOOKUP(A30,'Submission Template'!$K$5,1,FALSE)),\"\",C30)","v":""}]
["Rework",null,"Supply Plan Reduction","ReworkSupply Plan Reduction","Global Planning and Fulfillment",null,null,null,null,null,null,null,null,null,null,null,null,null,null,null,null,null,null,null,{"$f":"IF(ISERROR(VLOOKUP(A31,'Submission Template'!$K$5,1,FALSE)),\"\",C31)","v":""}]
["Reverse Claim - Excess & Obsolete",null,"AVL Changes","Reverse Claim - Excess & ObsoleteAVL Changes","Global Supplier Management",null,null,null,null,null,null,null,null,null,null,null,null,null,null,null,null,null,null,null,{"$f":"IF(ISERROR(VLOOKUP(A32,'Submission Template'!$K$5,1,FALSE)),\"\",C32)","v":""}]
["Reverse Claim - Excess & Obsolete",null,"ECO Changes","Reverse Claim - Excess & ObsoleteECO Changes","Product Lifecycle and Technology",null,null,null,null,null,null,null,null,null,null,null,null,null,null,null,null,null,null,null,{"$f":"IF(ISERROR(VLOOKUP(A33,'Submission Template'!$K$5,1,FALSE)),\"\",C33)","v":""}]
["Reverse Claim - Excess & Obsolete",null,"Last Time Buy","Reverse Claim - Excess & ObsoleteLast Time Buy","Global Planning and Fulfillment",null,null,null,null,null,null,null,null,null,null,null,null,null,null,null,null,null,null,null,{"$f":"IF(ISERROR(VLOOKUP(A34,'Submission Template'!$K$5,1,FALSE)),\"\",C34)","v":""}]
["Reverse Claim - Excess & Obsolete",null,"Part Purges","Reverse Claim - Excess & ObsoletePart Purges","Global Planning and Fulfillment",null,null,null,null,null,null,null,null,null,null,null,null,null,null,null,null,null,null,null,{"$f":"IF(ISERROR(VLOOKUP(A35,'Submission Template'!$K$5,1,FALSE)),\"\",C35)","v":""}]
["Reverse Claim - Excess & Obsolete",null,"Product End of Life","Reverse Claim - Excess & ObsoleteProduct End of Life","Product Lifecycle and Technology",null,null,null,null,null,null,null,null,null,null,null,null,null,null,null,null,null,null,null,{"$f":"IF(ISERROR(VLOOKUP(A36,'Submission Template'!$K$5,1,FALSE)),\"\",C36)","v":""}]
["Reverse Claim - Excess & Obsolete",null,"Quality Cost (Purge, Scrap, etc.)","Reverse Claim - Excess & ObsoleteQuality Cost (Purge, Scrap, etc.)","Global Manufacturing and Logistics",null,null,null,null,null,null,null,null,null,null,null,null,null,null,null,null,null,null,null,{"$f":"IF(ISERROR(VLOOKUP(A37,'Submission Template'!$K$5,1,FALSE)),\"\",C37)","v":""}]
["Reverse Claim - Excess & Obsolete",null,"Stop Production Notice","Reverse Claim - Excess & ObsoleteStop Production Notice","Global Planning and Fulfillment",null,null,null,null,null,null,null,null,null,null,null,null,null,null,null,null,null,null,null,{"$f":"IF(ISERROR(VLOOKUP(A38,'Submission Template'!$K$5,1,FALSE)),\"\",C38)","v":""}]
["Reverse Claim - Excess & Obsolete",null,"Supply Plan Reduction","Reverse Claim - Excess & ObsoleteSupply Plan Reduction","Global Planning and Fulfillment",null,null,null,null,null,null,null,null,null,null,null,null,null,null,null,null,null,null,null,{"$f":"IF(ISERROR(VLOOKUP(A39,'Submission Template'!$K$5,1,FALSE)),\"\",C39)","v":""}]
["Reverse Claim - Inventory Revaluation",null,"Inventory at EM/Qtr End Revalued for Price Changes","Reverse Claim - Inventory RevaluationInventory at EM/Qtr End Revalued for Price Changes","Global Supplier Management",null,null,null,null,null,null,null,null,null,null,null,null,null,null,null,null,null,null,null,{"$f":"IF(ISERROR(VLOOKUP(A40,'Submission Template'!$K$5,1,FALSE)),\"\",C40)","v":""}]
{"$rows_left_out":813}